Target
5-hydroxytryptamine receptor 4
Ligand
BDBM50105649
Substrate
Meas. Tech.
ChEMBL_3343 (CHEMBL619043)
Ki
0.32±n/a nM
Citation
 López-Rodríguez, MLMurcia, MBenhamú, BViso, ACampillo, MPardo, L Benzimidazole derivatives. 3. 3D-QSAR/CoMFA model and computational simulation for the recognition of 5-HT(4) receptor antagonists. J Med Chem 45:4806-15 (2002)  
Target
Name:
5-hydroxytryptamine receptor 4
Synonyms:
5-HT-4 5-HT4L 5-hydroxytryptamine receptor 4 Htr4 Serotonin 4 (5-HT4) receptor
Type:
Enzyme Catalytic Domain
Mol. Mass.:
46117.31
Organism:
RAT
Description:
5-HT4 HTR4 RAT::Q62758
Residue:
406
  
Inhibitor
Name:
BDBM50105649
Synonyms:
6-Chloro-1H-benzoimidazole-4-carboxylic acid (1-butyl-piperidin-4-ylmethyl)-amide | CHEMBL94880
Type:
Small organic molecule
Emp. Form.:
C18H25ClN4O
Mol. Mass.:
348.87
SMILES:
CCCCN1CCC(CNC(=O)c2cc(Cl)cc3nc[nH]c23)CC1
: