Target
Fibroblast growth factor 2
Ligand
BDBM50421574
Substrate
Meas. Tech.
ChEMBL_70468 (CHEMBL676959)
IC50
340±n/a nM
Citation
 Murphy, PVPitt, NO'Brien, AEnright, PMDunne, AWilson, SJDuane, RMO'Boyle, KM Identification of novel inhibitors of fibroblast growth factor (FGF-2) binding to heparin and endothelial cell survival from a structurally diverse carbohybrid library. Bioorg Med Chem Lett 12:3287-90 (2002)  
Target
Name:
Fibroblast growth factor 2
Synonyms:
Basic fibroblast growth factor FGF2 FGFB Fibroblast growth factor receptor 2 (FGF-2) Heparin-binding growth factor 2
Type:
Protein
Mol. Mass.:
30803.89
Organism:
Homo sapiens (Human)
Description:
P09038
Residue:
288
  
Inhibitor
Name:
BDBM50421574
Synonyms:
CHEMBL2303729
Type:
Small organic molecule
Emp. Form.:
C12H17NO9
Mol. Mass.:
319.2647
SMILES:
O[C@@H]1[C@H](O)[C@H](OCCN2C(=O)CCC2=O)O[C@H]([C@H]1O)C(O)=O
: