Target
Integrin alpha-V/beta-5
Ligand
BDBM50120517
Substrate
Meas. Tech.
ChEMBL_214771 (CHEMBL816229)
IC50
0.300000±n/a nM
Citation
 Perron-Sierra, FSaint Dizier, DBertrand, MGenton, ATucker, GCCasara, P Substituted benzocyloheptenes as potent and selective alpha(v) integrin antagonists. Bioorg Med Chem Lett 12:3291-6 (2002)  
Target
Name:
Integrin alpha-V/beta-5
Synonyms:
ITGAV/ITGB5 | Integrin beta-5/Vitronectin receptor alpha
Type:
Enzyme
Mol. Mass.:
Description:
Components:
This complex has 2 components.
Component 1
Name:
Integrin alpha-V
Synonyms:
ITAV_HUMAN Integrin alpha-V/alpha-5 VNRA Vitronectin receptor | Vitronectin receptor subunit alpha
Type:
PROTEIN
Mol. Mass.:
116024.92
Organism:
Homo sapiens (Human)
Description:
ChEMBL_582336
Residue:
1048
  
Component 2
Name:
Integrin beta-5
Synonyms:
ITB5_HUMAN | ITGB5
Type:
PROTEIN
Mol. Mass.:
88047.37
Organism:
Homo sapiens (Human)
Description:
EBI_10915
Residue:
799
  
Inhibitor
Name:
BDBM50120517
Synonyms:
CHEMBL109703 | {7-[(4-5,6,7,8-Tetrahydro-[1,8]naphthyridin-2-yl-butyrylamino)-methyl]-6,9-dihydro-5H-benzocyclohepten-5-yl}-acetic acid
Type:
Small organic molecule
Emp. Form.:
C26H31N3O3
Mol. Mass.:
433.5426
SMILES:
OC(=O)CC1CC(CNC(=O)CCCc2ccc3CCCNc3n2)=CCc2ccccc12
: