Target
Gonadotropin-releasing hormone receptor
Ligand
BDBM50120661
Substrate
Meas. Tech.
ChEBML_49074
IC50
0.500000±n/a nM
Citation
 Simeone, JPBugianesi, RLPonpipom, MMYang, YTLo, JLYudkovitz, JBCui, JMount, GRRen, RNCreighton, MMao, AHVincent, SHCheng, KGoulet, MT Modification of the pyridine moiety of non-peptidyl indole GnRH receptor antagonists. Bioorg Med Chem Lett 12:3329-32 (2002)  
Target
Name:
Gonadotropin-releasing hormone receptor
Synonyms:
GNRHR GRHR GnRH-R Gonadotropin-releasing hormone receptor | Gonadotropin-releasing hormone receptor (GnRH)
Type:
Enzyme
Mol. Mass.:
37749.45
Organism:
Homo sapiens (Human)
Description:
P30968
Residue:
328
  
Inhibitor
Name:
BDBM50120661
Synonyms:
1-(2-Aza-bicyclo[2.2.2]oct-2-yl)-2-[3-{(S)-2-[2-(2,6-dimethyl-1-oxy-pyridin-4-yl)-ethylamino]-1-methyl-ethyl}-2-(3,5-dimethyl-phenyl)-1H-indol-5-yl]-2-methyl-propan-1-one | CHEMBL431402
Type:
Small organic molecule
Emp. Form.:
C39H50N4O2
Mol. Mass.:
606.8399
SMILES:
C[C@H](CNCCc1cc(C)[n+]([O-])c(C)c1)c1c([nH]c2ccc(cc12)C(C)(C)C(=O)N1CC2CCC1CC2)-c1cc(C)cc(C)c1
: