Target
Nitric oxide synthase, brain
Ligand
BDBM50120680
Substrate
Meas. Tech.
ChEMBL_143346 (CHEMBL751928)
IC50
21000±n/a nM
Citation
 Tsymbalov, SHagen, TJMoore, WMJerome, GMConnor, JRManning, PTPitzele, BSHallinan, EA 3-Hydroxy-4-methyl-5-pentyl-2-iminopyrrolidine: a potent and highly selective inducible nitric oxide synthase inhibitor. Bioorg Med Chem Lett 12:3337-9 (2002)  
Target
Name:
Nitric oxide synthase, brain
Synonyms:
Constitutive NOS NC-NOS NOS type I nNOS NOS1_HUMAN Neuronal nitric oxide synthase Nitric oxide synthase, neuronal (nNOS) bNOS | nNOS
Type:
Homodimer
Mol. Mass.:
160985.98
Organism:
Homo sapiens (Human)
Description:
P29475
Residue:
1434
  
Inhibitor
Name:
BDBM50120680
Synonyms:
5-Imino-3-methyl-2-pentyl-pyrrolidinium; chloride | CHEMBL322480
Type:
Small organic molecule
Emp. Form.:
C10H21N2
Mol. Mass.:
169.2866
SMILES:
CCCCC[C@H]1[NH2+]C(=N)C[C@H]1C
: