Target
Gamma-aminobutyric acid receptor subunit alpha-3
Ligand
BDBM50120783
Substrate
Meas. Tech.
ChEMBL_68405 (CHEMBL678894)
EC50
20±n/a nM
Citation
 Albaugh, PAMarshall, LGregory, JWhite, GHutchison, ARoss, PCGallagher, DWTallman, JFCrago, MCassella, JV Synthesis and biological evaluation of 7,8,9,10-tetrahydroimidazo[1,2-c]pyrido[3,4-e]pyrimdin-5(6H)-ones as functionally selective ligands of the benzodiazepine receptor site on the GABA(A) receptor. J Med Chem 45:5043-51 (2002)  
Target
Name:
Gamma-aminobutyric acid receptor subunit alpha-3
Synonyms:
GABA A Alpha3Beta3Gamma2 GABA C GABA-A receptor GBRA3_HUMAN agonist GABA site
Type:
Enzyme Catalytic Domain
Mol. Mass.:
55175.47
Organism:
Homo sapiens (Human)
Description:
GABA A Alpha3Beta1Gamma2 0 HUMAN::P34903
Residue:
492
  
Inhibitor
Name:
BDBM50120783
Synonyms:
8-Benzyl-2-(2-fluoro-phenyl)-6,7,8,9-tetrahydro-5H-1,3a,5,8-tetraaza-cyclopenta[a]naphthalen-4-one | CHEMBL356161
Type:
Small organic molecule
Emp. Form.:
C22H19FN4O
Mol. Mass.:
374.4109
SMILES:
Fc1ccccc1-c1cn2c(n1)c1CN(Cc3ccccc3)CCc1[nH]c2=O
: