Target
Gamma-aminobutyric acid receptor subunit alpha-1
Ligand
BDBM50120779
Substrate
Meas. Tech.
ChEMBL_219118 (CHEMBL823141)
EC50
41±n/a nM
Citation
 Albaugh, PAMarshall, LGregory, JWhite, GHutchison, ARoss, PCGallagher, DWTallman, JFCrago, MCassella, JV Synthesis and biological evaluation of 7,8,9,10-tetrahydroimidazo[1,2-c]pyrido[3,4-e]pyrimdin-5(6H)-ones as functionally selective ligands of the benzodiazepine receptor site on the GABA(A) receptor. J Med Chem 45:5043-51 (2002)  
Target
Name:
Gamma-aminobutyric acid receptor subunit alpha-1
Synonyms:
Benzodiazepine central GABA A Benzodiazepine liver GABA(A) receptor subunit alpha-1 GABA-A receptor GBRA1_HUMAN TBPS | agonist GABA site
Type:
Protein
Mol. Mass.:
51817.35
Organism:
Homo sapiens (Human)
Description:
P14867
Residue:
456
  
Inhibitor
Name:
BDBM50120779
Synonyms:
8-(4-Fluoro-benzoyl)-2-(2-fluoro-phenyl)-6,7,8,9-tetrahydro-5H-1,3a,5,8-tetraaza-cyclopenta[a]naphthalen-4-one | CHEMBL147842
Type:
Small organic molecule
Emp. Form.:
C22H16F2N4O2
Mol. Mass.:
406.3848
SMILES:
Fc1ccc(cc1)C(=O)N1CCc2[nH]c(=O)n3cc(nc3c2C1)-c1ccccc1F
: