Target
Procathepsin L
Ligand
BDBM50121036
Substrate
Meas. Tech.
ChEBML_48518
IC50
6680±n/a nM
Citation
 Zhou, NEKaleta, JPurisima, EMenard, RMicetich, RGSingh, R 6-Acylamino-penam derivatives: synthesis and inhibition of cathepsins B, L, K, and S. Bioorg Med Chem Lett 12:3417-9 (2002)  
Target
Name:
Procathepsin L
Synonyms:
CATL1_RAT Ctsl | Ctsl1
Type:
PROTEIN
Mol. Mass.:
37662.10
Organism:
Rattus norvegicus
Description:
ChEMBL_48517
Residue:
334
  
Inhibitor
Name:
BDBM50121036
Synonyms:
CHEMBL421054 | [(S)-1-((R)-7-Oxo-4-thia-1-aza-bicyclo[3.2.0]hept-6-ylcarbamoyl)-2-(S)-phenyl-ethyl]-carbamic acid benzyl ester
Type:
Small organic molecule
Emp. Form.:
C22H23N3O4S
Mol. Mass.:
425.501
SMILES:
O=C(N[C@@H](Cc1ccccc1)C(=O)N[C@H]1[C@@H]2SCCN2C1=O)OCc1ccccc1
: