Target
Procathepsin L
Ligand
BDBM50121038
Substrate
Meas. Tech.
ChEBML_48518
IC50
3±n/a nM
Citation
 Zhou, NEKaleta, JPurisima, EMenard, RMicetich, RGSingh, R 6-Acylamino-penam derivatives: synthesis and inhibition of cathepsins B, L, K, and S. Bioorg Med Chem Lett 12:3417-9 (2002)  
Target
Name:
Procathepsin L
Synonyms:
CATL1_RAT Ctsl | Ctsl1
Type:
PROTEIN
Mol. Mass.:
37662.10
Organism:
Rattus norvegicus
Description:
ChEMBL_48517
Residue:
334
  
Inhibitor
Name:
BDBM50121038
Synonyms:
CHEMBL113706 | [(S)-2-Thiophen-2-yl-1-((5S,6R)-4,4,7-trioxo-4lambda*6*-thia-1-aza-bicyclo[3.2.0]hept-6-ylcarbamoyl)-ethyl]-carbamic acid benzyl ester
Type:
Small organic molecule
Emp. Form.:
C20H21N3O6S2
Mol. Mass.:
463.527
SMILES:
O=C(N[C@@H](Cc1cccs1)C(=O)N[C@H]1[C@H]2N(CCS2(=O)=O)C1=O)OCc1ccccc1
: