Target
Cathepsin S
Ligand
BDBM50121042
Substrate
Meas. Tech.
ChEBML_48690
IC50
3±n/a nM
Citation
 Zhou, NEKaleta, JPurisima, EMenard, RMicetich, RGSingh, R 6-Acylamino-penam derivatives: synthesis and inhibition of cathepsins B, L, K, and S. Bioorg Med Chem Lett 12:3417-9 (2002)  
Target
Name:
Cathepsin S
Synonyms:
CATS_HUMAN Cathepsin S (Cat S) | cathepsin S preproprotein
Type:
Protein
Mol. Mass.:
37507.38
Organism:
Homo sapiens (Human)
Description:
P25774
Residue:
331
  
Inhibitor
Name:
BDBM50121042
Synonyms:
CHEMBL323638 | [(S)-2-Naphthalen-2-yl-1-((5S,6R)-4,4,7-trioxo-4lambda*6*-thia-1-aza-bicyclo[3.2.0]hept-6-ylcarbamoyl)-ethyl]-carbamic acid benzyl ester
Type:
Small organic molecule
Emp. Form.:
C26H25N3O6S
Mol. Mass.:
507.558
SMILES:
O=C(N[C@@H](Cc1ccc2ccccc2c1)C(=O)N[C@H]1[C@H]2N(CCS2(=O)=O)C1=O)OCc1ccccc1
: