Target
Cathepsin S
Ligand
BDBM50121035
Substrate
Meas. Tech.
ChEBML_48690
IC50
70.0±n/a nM
Citation
 Zhou, NEKaleta, JPurisima, EMenard, RMicetich, RGSingh, R 6-Acylamino-penam derivatives: synthesis and inhibition of cathepsins B, L, K, and S. Bioorg Med Chem Lett 12:3417-9 (2002)  
Target
Name:
Cathepsin S
Synonyms:
CATS_HUMAN Cathepsin S (Cat S) | cathepsin S preproprotein
Type:
Protein
Mol. Mass.:
37507.38
Organism:
Homo sapiens (Human)
Description:
P25774
Residue:
331
  
Inhibitor
Name:
BDBM50121035
Synonyms:
CHEMBL326342 | [(S)-1-((R)-4-(S)-Oxo-7-oxo-4lambda*4*-thia-1-aza-bicyclo[3.2.0]hept-6-ylcarbamoyl)-2-phenyl-ethyl]-carbamic acid benzyl ester
Type:
Small organic molecule
Emp. Form.:
C22H23N3O5S
Mol. Mass.:
441.5
SMILES:
O=C(N[C@@H](Cc1ccccc1)C(=O)N[C@H]1[C@H]2N(CCS2=O)C1=O)OCc1ccccc1
: