Target
Cathepsin B
Ligand
BDBM50121040
Substrate
Meas. Tech.
ChEBML_47408
IC50
1300±n/a nM
Citation
 Zhou, NEKaleta, JPurisima, EMenard, RMicetich, RGSingh, R 6-Acylamino-penam derivatives: synthesis and inhibition of cathepsins B, L, K, and S. Bioorg Med Chem Lett 12:3417-9 (2002)  
Target
Name:
Cathepsin B
Synonyms:
APP secretase CATB_HUMAN CTSB Cathepsin B light chain | Cathepsin B1
Type:
Enzyme
Mol. Mass.:
37819.69
Organism:
Homo sapiens (Human)
Description:
gi_63102437
Residue:
339
  
Inhibitor
Name:
BDBM50121040
Synonyms:
CHEMBL117928 | [(S)-2-Pyridin-3-yl-1-((5S,6R)-4,4,7-trioxo-4lambda*6*-thia-1-aza-bicyclo[3.2.0]hept-6-ylcarbamoyl)-ethyl]-carbamic acid benzyl ester
Type:
Small organic molecule
Emp. Form.:
C21H22N4O6S
Mol. Mass.:
458.488
SMILES:
O=C(N[C@@H](Cc1cccnc1)C(=O)N[C@H]1[C@H]2N(CCS2(=O)=O)C1=O)OCc1ccccc1
: