Target
Gonadotropin-releasing hormone receptor
Ligand
BDBM50121101
Substrate
Meas. Tech.
ChEBML_71598
Ki
102±n/a nM
Citation
 Luthin, DRHong, YPathak, VPPaderes, GNared-Hood, KDCastro, MAVazir, HLi, HTompkins, EChristie, LMay, JMAnderson, MB The discovery of novel small molecule non-peptide gonadotropin releasing hormone (GnRH) receptor antagonists. Bioorg Med Chem Lett 12:3467-70 (2002)  
Target
Name:
Gonadotropin-releasing hormone receptor
Synonyms:
GNRHR GRHR GnRH-R Gonadotropin-releasing hormone receptor | Gonadotropin-releasing hormone receptor (GnRH)
Type:
Enzyme
Mol. Mass.:
37749.45
Organism:
Homo sapiens (Human)
Description:
P30968
Residue:
328
  
Inhibitor
Name:
BDBM50121101
Synonyms:
5-(3,5,5,8,8-Pentamethyl-5,6,7,8-tetrahydro-naphthalen-2-ylmethyl)-furan-2-carboxylic acid benzylamide | CHEMBL326313
Type:
Small organic molecule
Emp. Form.:
C28H33NO2
Mol. Mass.:
415.5671
SMILES:
Cc1cc2c(cc1Cc1ccc(o1)C(=O)NCc1ccccc1)C(C)(C)CCC2(C)C
: