Target
Gonadotropin-releasing hormone receptor
Ligand
BDBM50121100
Substrate
Meas. Tech.
ChEBML_71749
Ki
55±n/a nM
Citation
 Luthin, DRHong, YPathak, VPPaderes, GNared-Hood, KDCastro, MAVazir, HLi, HTompkins, EChristie, LMay, JMAnderson, MB The discovery of novel small molecule non-peptide gonadotropin releasing hormone (GnRH) receptor antagonists. Bioorg Med Chem Lett 12:3467-70 (2002)  
Target
Name:
Gonadotropin-releasing hormone receptor
Synonyms:
GNRHR_RAT GnRH-R | Gnrhr
Type:
PROTEIN
Mol. Mass.:
37767.60
Organism:
Rattus norvegicus
Description:
ChEMBL_1335047
Residue:
327
  
Inhibitor
Name:
BDBM50121100
Synonyms:
5-(3,5,5,8,8-Pentamethyl-5,6,7,8-tetrahydro-naphthalen-2-ylmethyl)-furan-2-carboxylic acid (5-methyl-pyrazin-2-ylmethyl)-amide | CHEMBL116246
Type:
Small organic molecule
Emp. Form.:
C27H33N3O2
Mol. Mass.:
431.5698
SMILES:
Cc1cnc(CNC(=O)c2ccc(Cc3cc4c(cc3C)C(C)(C)CCC4(C)C)o2)cn1
: