Target
Gonadotropin-releasing hormone receptor
Ligand
BDBM50121104
Substrate
Meas. Tech.
ChEBML_71749
Ki
3000±n/a nM
Citation
 Luthin, DRHong, YPathak, VPPaderes, GNared-Hood, KDCastro, MAVazir, HLi, HTompkins, EChristie, LMay, JMAnderson, MB The discovery of novel small molecule non-peptide gonadotropin releasing hormone (GnRH) receptor antagonists. Bioorg Med Chem Lett 12:3467-70 (2002)  
Target
Name:
Gonadotropin-releasing hormone receptor
Synonyms:
GNRHR_RAT GnRH-R | Gnrhr
Type:
PROTEIN
Mol. Mass.:
37767.60
Organism:
Rattus norvegicus
Description:
ChEMBL_1335047
Residue:
327
  
Inhibitor
Name:
BDBM50121104
Synonyms:
4-({[5-(3,5,5,8,8-Pentamethyl-5,6,7,8-tetrahydro-naphthalen-2-ylmethyl)-furan-2-carbonyl]-amino}-methyl)-cyclohexanecarboxylic acid | CHEMBL323687
Type:
Small organic molecule
Emp. Form.:
C29H39NO4
Mol. Mass.:
465.6243
SMILES:
Cc1cc2c(cc1Cc1ccc(o1)C(=O)NC[C@H]1CC[C@@H](CC1)C(O)=O)C(C)(C)CCC2(C)C
: