Target
Carboxypeptidase A1
Ligand
BDBM50121272
Substrate
Meas. Tech.
ChEMBL_45618 (CHEMBL655429)
Ki
650±n/a nM
Citation
 Park, JDKim, DHKim, SJWoo, JRRyu, SE Sulfamide-based inhibitors for carboxypeptidase A. Novel type transition state analogue inhibitors for zinc proteases. J Med Chem 45:5295-302 (2002)  
Target
Name:
Carboxypeptidase A1
Synonyms:
CBPA1_BOVIN CPA1 Carboxypeptidase A (CPA) | Carboxypeptidase A1 precursor
Type:
Enzyme
Mol. Mass.:
47073.90
Organism:
Bos taurus (bovine)
Description:
From Sigma-Aldrich Co.
Residue:
419
  
Inhibitor
Name:
BDBM50121272
Synonyms:
(2S)-2-[(aminosulfonyl)amino]-3-phenylpropanoic acid PHENYLALANINE-N-SULFONAMIDE
Type:
Small organic molecule
Emp. Form.:
C9H12N2O4S
Mol. Mass.:
244.268
SMILES:
NS(=O)(=O)N[C@@H](Cc1ccccc1)C(O)=O
: