Target
Gonadotropin-releasing hormone receptor
Ligand
BDBM50121472
Substrate
Meas. Tech.
ChEBML_71752
Ki
1.6±n/a nM
Citation
 Luthin, DRHong, YTompkins, EAnderes, KLPaderes, GKraynov, EACastro, MANared-Hood, KDCastillo, RGregory, MVazir, HMay, JMAnderson, MB Characterization of mono- and diaminopyrimidine derivatives as novel, nonpeptide gonadotropin releasing hormone (GnRH) receptor antagonists. Bioorg Med Chem Lett 12:3635-9 (2002)  
Target
Name:
Gonadotropin-releasing hormone receptor
Synonyms:
GNRHR_RAT GnRH-R | Gnrhr
Type:
PROTEIN
Mol. Mass.:
37767.60
Organism:
Rattus norvegicus
Description:
ChEMBL_1335047
Residue:
327
  
Inhibitor
Name:
BDBM50121472
Synonyms:
5-(3,5,5,8,8-Pentamethyl-5,6,7,8-tetrahydro-naphthalen-2-ylmethyl)-furan-2-carboxylic acid 3-[(4-{[(S)-1-(tetrahydro-furan-2-yl)methyl]-amino}-pyrimidin-2-ylamino)-methyl]-benzylamide | CHEMBL124056
Type:
Small organic molecule
Emp. Form.:
C38H47N5O3
Mol. Mass.:
621.8115
SMILES:
Cc1cc2c(cc1Cc1ccc(o1)C(=O)NCc1cccc(CNc3nccc(NC[C@@H]4CCCO4)n3)c1)C(C)(C)CCC2(C)C
: