Target
Cathepsin S
Ligand
BDBM50121581
Substrate
Meas. Tech.
ChEMBL_48672 (CHEMBL658343)
IC50
8±n/a nM
Citation
 Ward, YDThomson, DSFrye, LLCywin, CLMorwick, TEmmanuel, MJZindell, RMcNeil, DBekkali, YGirardot, MHrapchak, MDeTuri, MCrane, KWhite, DPav, SWang, YHao, MHGrygon, CALabadia, MEFreeman, DMDavidson, WHopkins, JLBrown, MLSpero, DMGiradot, M Design and synthesis of dipeptide nitriles as reversible and potent Cathepsin S inhibitors. J Med Chem 45:5471-82 (2002)  
Target
Name:
Cathepsin S
Synonyms:
CATS_HUMAN Cathepsin S (Cat S) | cathepsin S preproprotein
Type:
Protein
Mol. Mass.:
37507.38
Organism:
Homo sapiens (Human)
Description:
P25774
Residue:
331
  
Inhibitor
Name:
BDBM50121581
Synonyms:
CHEMBL150253 | Morpholine-4-carboxylic acid (1-{[(2-chloro-benzyloxymethyl)-cyano-methyl]-carbamoyl}-2-cyclohexyl-ethyl)-amide
Type:
Small organic molecule
Emp. Form.:
C24H33ClN4O4
Mol. Mass.:
476.996
SMILES:
Clc1ccccc1COC[C@H](NC(=O)[C@H](CC1CCCCC1)NC(=O)N1CCOCC1)C#N
: