Target
Cathepsin S
Ligand
BDBM50121906
Substrate
Meas. Tech.
ChEBML_48668
IC50
>2500±n/a nM
Citation
 Zhou, NEGuo, DThomas, GReddy, AVKaleta, JPurisima, EMenard, RMicetich, RGSingh, R 3-Acylamino-azetidin-2-one as a novel class of cysteine proteases inhibitors. Bioorg Med Chem Lett 13:139-41 (2002)  
Target
Name:
Cathepsin S
Synonyms:
CATS_HUMAN Cathepsin S (Cat S) | cathepsin S preproprotein
Type:
Protein
Mol. Mass.:
37507.38
Organism:
Homo sapiens (Human)
Description:
P25774
Residue:
331
  
Inhibitor
Name:
BDBM50121906
Synonyms:
CHEMBL31363 | [(S)-1-((2S,3S)-2-Isobutoxy-4-oxo-azetidin-3-ylcarbamoyl)-2-phenyl-ethyl]-carbamic acid benzyl ester
Type:
Small organic molecule
Emp. Form.:
C24H29N3O5
Mol. Mass.:
439.5042
SMILES:
CC(C)CO[C@@H]1NC(=O)[C@H]1NC(=O)[C@H](Cc1ccccc1)NC(=O)OCc1ccccc1
: