Target
Cathepsin K
Ligand
BDBM50121901
Substrate
Meas. Tech.
ChEBML_45544
IC50
100±n/a nM
Citation
 Zhou, NEGuo, DThomas, GReddy, AVKaleta, JPurisima, EMenard, RMicetich, RGSingh, R 3-Acylamino-azetidin-2-one as a novel class of cysteine proteases inhibitors. Bioorg Med Chem Lett 13:139-41 (2002)  
Target
Name:
Cathepsin K
Synonyms:
CATK_HUMAN CTSO Cathepsin O Cathepsin X
Type:
Enzyme
Mol. Mass.:
36975.68
Organism:
Homo sapiens (Human)
Description:
P43235
Residue:
329
  
Inhibitor
Name:
BDBM50121901
Synonyms:
Acetic acid (2S,3S)-3-((S)-2-benzyloxycarbonylamino-3-phenyl-propionylamino)-4-oxo-azetidin-2-yl ester | CHEMBL417303
Type:
Small organic molecule
Emp. Form.:
C22H23N3O6
Mol. Mass.:
425.4345
SMILES:
CC(=O)O[C@@H]1NC(=O)[C@H]1NC(=O)[C@H](Cc1ccccc1)NC(=O)OCc1ccccc1
: