Target
Glutamate receptor 1
Ligand
BDBM50122079
Substrate
Meas. Tech.
ChEMBL_72845 (CHEMBL680870)
Ki
350±n/a nM
Citation
 Kromann, HKrikstolaityte, SAndersen, AJAndersen, KKrogsgaard-Larsen, PJaroszewski, JWEgebjerg, JStrømgaard, K Solid-phase synthesis of polyamine toxin analogues: potent and selective antagonists of Ca2+-permeable AMPA receptors. J Med Chem 45:5745-54 (2002)  
Target
Name:
Glutamate receptor 1
Synonyms:
AMPA-selective glutamate receptor 1 GLUR1 GRIA1_HUMAN GluR-A Glutamate AMPA 1 Glutamate receptor AMPA 1/2 Glutamate receptor ionotropic, AMPA 1
Type:
Enzyme Catalytic Domain
Mol. Mass.:
101512.92
Organism:
Homo sapiens (Human)
Description:
Glutamate AMPA 1 GRIA1 HUMAN::P42261
Residue:
906
  
Inhibitor
Name:
BDBM50122079
Synonyms:
CHEMBL154184 | N-[2-[3-(8-Amino-octylamino)-propylamino]-2-hydroxy-1-(4-hydroxy-benzyl)-ethyl]-butyramide
Type:
Small organic molecule
Emp. Form.:
C24H44N4O3
Mol. Mass.:
436.6312
SMILES:
CCCC(=O)NC(Cc1ccc(O)cc1)C(O)NCCCNCCCCCCCCN
: