Target
Poly [ADP-ribose] polymerase 1
Ligand
BDBM50122778
Substrate
Meas. Tech.
ChEMBL_159660 (CHEMBL761788)
Ki
45±n/a nM
Citation
 Skalitzky, DJMarakovits, JTMaegley, KAEkker, AYu, XHHostomsky, ZWebber, SEEastman, BWAlmassy, RLi, JCurtin, NJNewell, DRCalvert, AHGriffin, RJGolding, BT Tricyclic benzimidazoles as potent poly(ADP-ribose) polymerase-1 inhibitors. J Med Chem 46:210-3 (2003)  
Target
Name:
Poly [ADP-ribose] polymerase 1
Synonyms:
(ARTD1 or PARP1) 2.4.2.30 ADPRT ARTD1 Human diphtheria toxin-like ADP-ribosyltransferase (ARTD1 or PARP1) NT-PARP-1 PARP1 PPOL Poly [ADP-ribose] polymerase 1 (PARP) Poly [ADP-ribose] polymerase 1 (PARP1) Poly [ADP-ribose] polymerase 1, 28-kDa form Poly [ADP-ribose] polymerase 1, processed C-terminus Poly [ADP-ribose] polymerase-1 Poly(ADP-ribose) polymerase-1 (ARTD1/PARP1) Protein poly-ADP-ribosyltransferase PARP1 | Synonyms=ADPRT
Type:
Mol. Mass.:
113114.22
Organism:
Homo sapiens (Human)
Description:
P09874
Residue:
1014
  
Inhibitor
Name:
BDBM50122778
Synonyms:
1-Methyl-8,9-dihydro-7H-2,7,9a-triaza-benzo[cd]azulen-6-one | CHEMBL294060
Type:
Small organic molecule
Emp. Form.:
C11H11N3O
Mol. Mass.:
201.2245
SMILES:
Cc1nc2cccc3C(=O)NCCn1c23
: