Target
cGMP-specific 3',5'-cyclic phosphodiesterase
Ligand
BDBM50122989
Substrate
Meas. Tech.
ChEMBL_155375 (CHEMBL760828)
Ki
0.980000±n/a nM
Citation
 Jiang, WSui, ZMacielag, MJWalsh, SPFiordeliso, JJLanter, JCGuan, JQiu, YKraft, PBhattacharjee, SCraig, EHaynes-Johnson, DJohn, TMClancy, J Furoyl and benzofuroyl pyrroloquinolones as potent and selective PDE5 inhibitors for treatment of erectile dysfunction. J Med Chem 46:441-4 (2003)  
Target
Name:
cGMP-specific 3',5'-cyclic phosphodiesterase
Synonyms:
3',5'-cyclic phosphodiesterase PDE5 PDE5A_HUMAN Phosphodiesterase 5 (PDE5) Phosphodiesterase 5A (PDE5A) cGMP-specific 3',5'-cyclic phosphodiesterase
Type:
Protein
Mol. Mass.:
99975.83
Organism:
Homo sapiens (Human)
Description:
O76074
Residue:
875
  
Inhibitor
Name:
BDBM50122989
Synonyms:
3-Benzo[1,3]dioxol-5-yl-2-[5-(3-trifluoromethyl-phenyl)-furan-2-carbonyl]-1,2,3,4-tetrahydro-pyrrolo[3,4-b]quinolin-9-one | CHEMBL344152
Type:
Small organic molecule
Emp. Form.:
C30H19F3N2O5
Mol. Mass.:
544.4775
SMILES:
Oc1c2CN(C(c2nc2ccccc12)c1ccc2OCOc2c1)C(=O)c1ccc(o1)-c1cccc(c1)C(F)(F)F
: