Target
Estrogen receptor beta
Ligand
BDBM50123211
Substrate
Meas. Tech.
ChEBML_67193
IC50
21±n/a nM
Citation
 Blizzard, TAMorgan, JDMosley, RTBirzin, ETFrisch, KRohrer, SPHammond, ML 2-Phenylspiroindenes: a novel class of selective estrogen receptor modulators (SERMs). Bioorg Med Chem Lett 13:479-83 (2003)  
Target
Name:
Estrogen receptor beta
Synonyms:
ER-beta ESR2_HUMAN Estradiol receptor beta (ERβ) Estrogen receptor (ER beta) Estrogen receptor beta (ER beta) NR3A2 estrogen beta
Type:
Protein
Mol. Mass.:
59238.43
Organism:
Homo sapiens (Human)
Description:
Q92731
Residue:
530
  
Inhibitor
Name:
BDBM50123211
Synonyms:
2-phenyl-1,2'-spirobi[1H-indene]-5-ol | CHEMBL144897
Type:
Small organic molecule
Emp. Form.:
C23H18O
Mol. Mass.:
310.3884
SMILES:
Oc1ccc2c(C=C(c3ccccc3)C22Cc3ccccc3C2)c1
: