Target
Neuronal acetylcholine receptor subunit alpha-4/beta-2
Ligand
BDBM50123270
Substrate
Meas. Tech.
ChEMBL_143553 (CHEMBL755326)
Ki
0.027000±n/a nM
Citation
 Zhang, NTomizawa, MCasida, JE 5-Azidoepibatidine: an exceptionally potent photoaffinity ligand for neuronal alpha 4 beta 2 and alpha 7 nicotinic acetylcholine receptors. Bioorg Med Chem Lett 13:525-7 (2003)  
Target
Name:
Neuronal acetylcholine receptor subunit alpha-4/beta-2
Synonyms:
Neuronal acetylcholine receptor Alpha-4/Beta-2 Neuronal acetylcholine receptor; alpha4/beta2 | nAChR subtypes alpha4 beta2
Type:
Protein
Mol. Mass.:
Description:
Components:
This complex has 2 components.
Component 1
Name:
Neuronal acetylcholine receptor subunit alpha-4
Synonyms:
ACHA4_HUMAN CHRNA4 protein Neuronal acetylcholine receptor protein alpha-4 subunit Nicotinic acetylcholine receptor alpha4/beta2/alpha5
Type:
Mol. Mass.:
69963.49
Organism:
Homo sapiens (Human)
Description:
NACHRA4
Residue:
627
  
Component 2
Name:
Neuronal acetylcholine receptor subunit beta-2
Synonyms:
ACHB2_HUMAN Neuronal acetylcholine receptor protein beta-2 subunit | Nicotinic acetylcholine receptor alpha3/beta2/alpha5
Type:
Protein
Mol. Mass.:
57020.50
Organism:
Homo sapiens (Human)
Description:
P17787
Residue:
502
  
Inhibitor
Name:
BDBM50123270
Synonyms:
2-(5-Azido-6-chloro-pyridin-3-yl)-7-aza-bicyclo[2.2.1]heptane azidoepibatidine
Type:
Small organic molecule
Emp. Form.:
C11H12ClN5
Mol. Mass.:
249.699
SMILES:
Clc1ncc(cc1N=[N+]=[N-])C1CC2CCC1N2
: