Target
Muscarinic acetylcholine receptor M2
Ligand
BDBM50123439
Substrate
Meas. Tech.
ChEBML_138182
Ki
1225±n/a nM
Citation
 McCombie, SWTagat, JRVice, SFLin, SISteensma, RPalani, ANeustadt, BRBaroudy, BMStrizki, JMEndres, MCox, KDan, NChou, CC Piperazine-based CCR5 antagonists as HIV-1 inhibitors. III: synthesis, antiviral and pharmacokinetic profiles of symmetrical heteroaryl carboxamides. Bioorg Med Chem Lett 13:567-71 (2003)  
Target
Name:
Muscarinic acetylcholine receptor M2
Synonyms:
ACM2_HUMAN Cholinergic, muscarinic M2 Muscarinic acetylcholine receptor M2 and M5 | RecName: Full=Muscarinic acetylcholine receptor M2
Type:
GPCR
Mol. Mass.:
51730.61
Organism:
Homo sapiens (Human)
Description:
P08172
Residue:
466
  
Inhibitor
Name:
BDBM50123439
Synonyms:
(4,6-Dimethyl-2-phenyl-pyrimidin-5-yl)-(4-methyl-4-{(S)-3-methyl-4-[(S)-1-(4-trifluoromethyl-phenyl)-ethyl]-piperazin-1-yl}-piperidin-1-yl)-methanone | CHEMBL344607
Type:
Small organic molecule
Emp. Form.:
C33H40F3N5O
Mol. Mass.:
579.6988
SMILES:
C[C@H](N1CCN(C[C@@H]1C)C1(C)CCN(CC1)C(=O)c1c(C)nc(nc1C)-c1ccccc1)c1ccc(cc1)C(F)(F)F
: