Target
Mu-type opioid receptor
Ligand
BDBM50085020
Substrate
Meas. Tech.
ChEMBL_145281 (CHEMBL751217)
Ki
1.10±n/a nM
Citation
 Wentland, MPYe, YCioffi, CLLou, RZhou, QXu, GDuan, WDehnhardt, CMSun, XCohen, DJBidlack, JM Syntheses and opioid receptor binding affinities of 8-amino-2,6-methano-3-benzazocines. J Med Chem 46:838-49 (2003)  
Target
Name:
Mu-type opioid receptor
Synonyms:
M-OR-1 Mu opioid receptor OPIATE Mu OPRM_CAVPO
Type:
Enzyme Catalytic Domain
Mol. Mass.:
11165.58
Organism:
GUINEA PIG
Description:
P97266
Residue:
98
  
Inhibitor
Name:
BDBM50085020
Synonyms:
((6S,11R)-3-Cyclopropylmethyl-6,11-dimethyl-1,2,3,4,5,6-hexahydro-2,6-methano-benzo[d]azocin-8-yl)-phenyl-amine CHEMBL2367916
Type:
Small organic molecule
Emp. Form.:
C24H30N2
Mol. Mass.:
346.5084
SMILES:
[H][C@]12Cc3ccc(Nc4ccccc4)cc3[C@@](C)(CCN1CC1CC1)[C@H]2C
: