Target
Delta-type opioid receptor
Ligand
BDBM50085026
Substrate
Meas. Tech.
ChEMBL_147150 (CHEMBL758175)
Ki
250±n/a nM
Citation
 Wentland, MPYe, YCioffi, CLLou, RZhou, QXu, GDuan, WDehnhardt, CMSun, XCohen, DJBidlack, JM Syntheses and opioid receptor binding affinities of 8-amino-2,6-methano-3-benzazocines. J Med Chem 46:838-49 (2003)  
Target
Name:
Delta-type opioid receptor
Synonyms:
D-OR-1 Delta opioid receptor OPIATE Delta OPRD1 OPRK1 | opioid receptor, delta 1
Type:
G Protein-Coupled Receptor (GPCR)
Mol. Mass.:
40382.98
Organism:
Homo sapiens (Human)
Description:
Competition binding assays were carried out using membrane preparations from transfected HN9.10 cells that constitutively expressed the delta opioid receptor.
Residue:
372
  
Inhibitor
Name:
BDBM50085026
Synonyms:
(6S,11R)-3-Cyclopropylmethyl-6,11-dimethyl-8-(4-methyl-piperazin-1-yl)-1,2,3,4,5,6-hexahydro-2,6-methano-benzo[d]azocine CHEMBL55392
Type:
Small organic molecule
Emp. Form.:
C23H35N3
Mol. Mass.:
353.5441
SMILES:
C[C@H]1C2Cc3ccc(cc3[C@@]1(C)CCN2CC1CC1)N1CCN(C)CC1
: