Target
Muscarinic acetylcholine receptor M1
Ligand
BDBM50124134
Substrate
Meas. Tech.
ChEBML_139205
Ki
510±n/a nM
Citation
 Büttelmann, BAlanine, ABourson, AGill, RHeitz, MPMutel, VPinard, ETrube, GWyler, R 2-(3,4-Dihydro-1H-isoquinolin-2yl)-pyridines as a novel class of NR1/2B subtype selective NMDA receptor antagonists. Bioorg Med Chem Lett 13:829-32 (2003)  
Target
Name:
Muscarinic acetylcholine receptor M1
Synonyms:
ACM1_HUMAN Cholinergic receptor, muscarinic 1 | Cholinergic, muscarinic M1
Type:
Protein
Mol. Mass.:
51442.54
Organism:
Homo sapiens (Human)
Description:
P11229
Residue:
460
  
Inhibitor
Name:
BDBM50124134
Synonyms:
2-(3,4-Dihydro-1H-isoquinolin-2-yl)-6,7-dihydro-5H-[1]pyrindin-4-ylamine | CHEMBL169469
Type:
Small organic molecule
Emp. Form.:
C17H19N3
Mol. Mass.:
265.3529
SMILES:
Nc1cc(nc2CCCc12)N1CCc2ccccc2C1
: