Target
Dihydropyrimidine dehydrogenase [NADP(+)]
Ligand
BDBM50124203
Substrate
Meas. Tech.
ChEBML_53186
IC50
220±n/a nM
Citation
 Hattori, KKohchi, YOikawa, NSuda, HUra, MIshikawa, TMiwa, MEndoh, MEda, HTanimura, HKawashima, AHorii, IIshitsuka, HShimma, N Design and synthesis of the tumor-activated prodrug of dihydropyrimidine dehydrogenase (DPD) inhibitor, RO0094889 for combination therapy with capecitabine. Bioorg Med Chem Lett 13:867-72 (2003)  
Target
Name:
Dihydropyrimidine dehydrogenase [NADP(+)]
Synonyms:
DHPDHase DPYD Dihydropyrimidine dehydrogenase Dihydrothymine dehydrogenase | Dihydrouracil dehydrogenase
Type:
PROTEIN
Mol. Mass.:
111404.27
Organism:
Homo sapiens (Human)
Description:
ChEMBL_53186
Residue:
1025
  
Inhibitor
Name:
BDBM50124203
Synonyms:
5-IODOURACIL CHEMBL1173
Type:
Small organic molecule
Emp. Form.:
C4H3IN2O2
Mol. Mass.:
237.9833
SMILES:
Ic1c[nH]c(=O)[nH]c1=O
: