Target
Glucocorticoid receptor
Ligand
BDBM50107347
Substrate
Meas. Tech.
ChEMBL_71398 (CHEMBL874034)
Ki
2.5±n/a nM
Citation
 Kym, PRKort, MECoghlan, MJMoore, JLTang, RRatajczyk, JDLarson, DPElmore, SWPratt, JKStashko, MAFalls, HDLin, CWNakane, MMiller, LTyree, CMMiner, JNJacobson, PBWilcox, DMNguyen, PLane, BC Nonsteroidal selective glucocorticoid modulators: the effect of C-10 substitution on receptor selectivity and functional potency of 5-allyl-2,5-dihydro-2,2,4-trimethyl-1H-[1]benzopyrano[3,4-f]quinolines. J Med Chem 46:1016-30 (2003)  
Target
Name:
Glucocorticoid receptor
Synonyms:
GCR_HUMAN GRL Glucocorticoid receptor (GRFP) Nuclear receptor subfamily 3 group C member 1
Type:
Enzyme
Mol. Mass.:
85656.87
Organism:
Homo sapiens (Human)
Description:
P04150
Residue:
777
  
Inhibitor
Name:
BDBM50107347
Synonyms:
(+)5-Allyl-10-methoxy-2,2,4-trimethyl-2,5-dihydro-1H-6-oxa-1-aza-chrysene (-)5-Allyl-10-methoxy-2,2,4-trimethyl-2,5-dihydro-1H-6-oxa-1-aza-chrysene 5-allyl-10-methoxy-2,2,4-trimethyl-2,5-dihydro-1H-chromeno[3,4-f]quinoline | CHEMBL266282
Type:
Small organic molecule
Emp. Form.:
C23H25NO2
Mol. Mass.:
347.4501
SMILES:
COc1cccc2OC(CC=C)c3c(ccc4NC(C)(C)C=C(C)c34)-c12
: