Target
D(2) dopamine receptor
Ligand
BDBM50092054
Substrate
Meas. Tech.
ChEBML_61299
Ki
>1000±n/a nM
Citation
 Zhao, HZhang, XHodgetts, KThurkauf, AHammer, JChandrasekhar, JKieltyka, ABrodbeck, RRachwal, SPrimus, RManly, C Design, synthesis, and discovery of 5-piperazinyl-1,2,6,7-tetrahydro-5H-azepino[3,2,1-hi]indol-4-one derivatives: a novel series of mixed dopamine D2/D4 receptor antagonist. Bioorg Med Chem Lett 13:701-4 (2003)  
Target
Name:
D(2) dopamine receptor
Synonyms:
D(2) dopamine receptor DOPAMINE D2 Long DRD2 Dopamine D2 receptor Dopamine D2 receptor (D2R) Dopamine2-like | d2
Type:
Cell-surface receptors
Mol. Mass.:
50647.10
Organism:
Homo sapiens (Human)
Description:
P14416
Residue:
443
  
Inhibitor
Name:
BDBM50092054
Synonyms:
3-[4-(4-Chloro-benzyl)-piperazin-1-yl]-1-ethyl-1,3,4,5-tetrahydro-benzo[b]azepin-2-one | CHEMBL67414
Type:
Small organic molecule
Emp. Form.:
C23H28ClN3O
Mol. Mass.:
397.941
SMILES:
CCN1c2ccccc2CCC(N2CCN(Cc3ccc(Cl)cc3)CC2)C1=O
: