Target
C-C chemokine receptor type 5
Ligand
BDBM50124940
Substrate
Meas. Tech.
ChEMBL_39653 (CHEMBL650747)
Ki
98±n/a nM
Citation
 Palani, AShapiro, SClader, JWGreenlee, WJBlythin, DCox, KWagner, NEStrizki, JBaroudy, BMDan, N Biological evaluation and interconversion studies of rotamers of SCH 351125, an orally bioavailable CCR5 antagonist. Bioorg Med Chem Lett 13:705-8 (2003)  
Target
Name:
C-C chemokine receptor type 5
Synonyms:
C-C CKR-5 CC-CKR-5 CCR5 CCR5_HUMAN CHEMR13 HIV-1 fusion coreceptor
Type:
Enzyme
Mol. Mass.:
40540.21
Organism:
Homo sapiens (Human)
Description:
P51681
Residue:
352
  
Inhibitor
Name:
BDBM50124940
Synonyms:
(2,4-Dimethyl-1-oxy-pyridin-3-yl)-(4'-methyl-[1,4']bipiperidinyl-1'-yl)-methanone | CHEMBL163078
Type:
Small organic molecule
Emp. Form.:
C19H29N3O2
Mol. Mass.:
331.4525
SMILES:
Cc1cc[n+]([O-])c(C)c1C(=O)N1CCC(C)(CC1)N1CCCCC1
: