Target
Coagulation factor X
Ligand
BDBM50124975
Substrate
Meas. Tech.
ChEMBL_48999 (CHEMBL662880)
Ki
0.170000±n/a nM
Citation
 Huang, WNaughton, MAYang, HSu, TDam, SWong, PWArfsten, AEdwards, SSinha, UHollenbach, SScarborough, RMZhu, BY Design, synthesis, and structure-activity relationships of unsubstituted piperazinone-based transition state factor Xa inhibitors. Bioorg Med Chem Lett 13:723-8 (2003)  
Target
Name:
Coagulation factor X
Synonyms:
Activated coagulation factor X (FXa) Coagulation factor X precursor F10 Factor X heavy chain Factor Xa Stuart-Prower factor
Type:
Enzyme
Mol. Mass.:
54726.60
Organism:
Homo sapiens (Human)
Description:
Residue:
488
  
Inhibitor
Name:
BDBM50124975
Synonyms:
2-[4-(5-Chloro-3-methyl-benzo[b]thiophene-2-sulfonyl)-2-oxo-piperazin-1-yl]-N-[4-guanidino-1-(thiazole-2-carbonyl)-butyl]-acetamide | CHEMBL423810
Type:
Small organic molecule
Emp. Form.:
C24H28ClN7O5S3
Mol. Mass.:
626.171
SMILES:
Cc1c(sc2ccc(Cl)cc12)S(=O)(=O)N1CCN(CC(=O)NC(CCCNC(N)=N)C(=O)c2nccs2)C(=O)C1
: