Target
Sigma non-opioid intracellular receptor 1
Ligand
BDBM50125093
Substrate
Meas. Tech.
ChEBML_202046
Ki
0.580000±n/a nM
Citation
 Foster, AWu, HChen, WWilliams, WBowen, WDMatsumoto, RRCoop, A 1,4-dibenzylpiperazines possess anticocaine activity. Bioorg Med Chem Lett 13:749-51 (2003)  
Target
Name:
Sigma non-opioid intracellular receptor 1
Synonyms:
Aging-associated gene 8 protein SGMR1_HUMAN SIGMAR1 SR31747-binding protein Sigma 1-type opioid receptor Sigma1R | hSigmaR1
Type:
Enzyme Catalytic Domain
Mol. Mass.:
25124.85
Organism:
Homo sapiens (Human)
Description:
Q99720
Residue:
223
  
Inhibitor
Name:
BDBM50125093
Synonyms:
1-Benzyl-4-(3,4-dichloro-benzyl)-piperazine | CHEMBL162807
Type:
Small organic molecule
Emp. Form.:
C18H20Cl2N2
Mol. Mass.:
335.271
SMILES:
Clc1ccc(CN2CCN(Cc3ccccc3)CC2)cc1Cl
: