Target
Vasopressin V2 receptor
Ligand
BDBM50065115
Substrate
Meas. Tech.
ChEMBL_214716 (CHEMBL815214)
IC50
91±n/a nM
Citation
 Matthews, JMGreco, MNHecker, LRHoekstra, WJAndrade-Gordon, Pde Garavilla, LDemarest, KTEricson, EGunnet, JWHageman, WLook, RMoore, JBMaryanoff, BE Synthesis and biological evaluation of novel indoloazepine derivatives as non-peptide vasopressin V2 receptor antagonists. Bioorg Med Chem Lett 13:753-6 (2003)  
Target
Name:
Vasopressin V2 receptor
Synonyms:
ADHR AVPR2 DIR Renal-type arginine vasopressin receptor V2R_HUMAN Vasopressin V2 receptor | Vasopressin receptor
Type:
Receptor
Mol. Mass.:
40295.28
Organism:
Homo sapiens (Human)
Description:
P30518
Residue:
371
  
Inhibitor
Name:
BDBM50065115
Synonyms:
3-chloro-4-(10,11-dihydro-5H-benzo[e]pyrrolo[1,2-a][1,4]diazepin-10-ylcarbonyl)-1-(5-fluoro-2-methylphenylcarboxamido)benzene Lixivaptan | N-[4-(5H,11H-Benzo[e]pyrrolo[1,2-a][1,4]diazepine-10-carbonyl)-3-chloro-phenyl]-5-fluoro-2-methyl-benzamide
Type:
Small organic molecule
Emp. Form.:
C27H21ClFN3O2
Mol. Mass.:
473.926
SMILES:
Cc1ccc(F)cc1C(=O)Nc1ccc(C(=O)N2Cc3cccn3Cc3ccccc23)c(Cl)c1
: