Target
5-hydroxytryptamine receptor 2A
Ligand
BDBM50125154
Substrate
Meas. Tech.
ChEBML_2457
Ki
0.500000±n/a nM
Citation
 Lee, TRobichaud, AJBoyle, KELu, YRobertson, DWMiller, KJFitzgerald, LWMcElroy, JFLargent, BL Novel, highly potent, selective 5-HT2A/D2 receptor antagonists as potential atypical antipsychotics. Bioorg Med Chem Lett 13:767-70 (2003)  
Target
Name:
5-hydroxytryptamine receptor 2A
Synonyms:
5-HT-2 5-HT2A 5-hydroxytryptamine receptor 2A (5HT-2A) 5HT2A_HUMAN HTR2A | Serotonin receptor 2A
Type:
undefined
Mol. Mass.:
52607.65
Organism:
Homo sapiens (Human)
Description:
P28223
Residue:
471
  
Inhibitor
Name:
BDBM50125154
Synonyms:
1-(2-Amino-4-fluoro-phenyl)-4-(7aS,11aR)-5,6,8,9,11,11a-hexahydro-4H,7aH-pyrido[3',4':4,5]pyrrolo[3,2,1-ij]quinolin-10-yl-butan-1-one | CHEMBL351592
Type:
Small organic molecule
Emp. Form.:
C24H28FN3O
Mol. Mass.:
393.497
SMILES:
Nc1cc(F)ccc1C(=O)CCCN1CC[C@H]2[C@@H](C1)c1cccc3CCCN2c13
: