Target
5-hydroxytryptamine receptor 2A
Ligand
BDBM50125170
Substrate
Meas. Tech.
ChEBML_2457
Ki
0.600000±n/a nM
Citation
 Lee, TRobichaud, AJBoyle, KELu, YRobertson, DWMiller, KJFitzgerald, LWMcElroy, JFLargent, BL Novel, highly potent, selective 5-HT2A/D2 receptor antagonists as potential atypical antipsychotics. Bioorg Med Chem Lett 13:767-70 (2003)  
Target
Name:
5-hydroxytryptamine receptor 2A
Synonyms:
5-HT-2 5-HT2A 5-hydroxytryptamine receptor 2A (5HT-2A) 5HT2A_HUMAN HTR2A | Serotonin receptor 2A
Type:
undefined
Mol. Mass.:
52607.65
Organism:
Homo sapiens (Human)
Description:
P28223
Residue:
471
  
Inhibitor
Name:
BDBM50125170
Synonyms:
1-(2-Amino-4-fluoro-phenyl)-4-(7bS,11aR)-4,5,6,7,8,9,11,11a-octahydro-7bH-7a,10-diaza-cyclohepta[jk]fluoren-10-yl-butan-1-one | CHEMBL349683
Type:
Small organic molecule
Emp. Form.:
C25H30FN3O
Mol. Mass.:
407.5236
SMILES:
Nc1cc(F)ccc1C(=O)CCCN1CC[C@H]2[C@@H](C1)c1cccc3CCCCN2c13
: