Target
5-hydroxytryptamine receptor 7
Ligand
BDBM50222900
Substrate
Meas. Tech.
ChEMBL_3709 (CHEMBL618161)
Ki
0.407380±n/a nM
Citation
 Forbes, ITCooper, DGDodds, EKDouglas, SEGribble, ADIfe, RJLightfoot, APMeeson, MCampbell, LPColeman, TRiley, GJThomas, DR Identification of a novel series of selective 5-HT7 receptor antagonists. Bioorg Med Chem Lett 13:1055-8 (2003)  
Target
Name:
5-hydroxytryptamine receptor 7
Synonyms:
5-HT-7 5-HT7 5-HT7S 5HT7 HTR7 | Serotonin receptor 7
Type:
G Protein-Coupled Receptor (GPCR)
Mol. Mass.:
53573.08
Organism:
Homo sapiens (Human)
Description:
P34969
Residue:
479
  
Inhibitor
Name:
BDBM50222900
Synonyms:
CHEMBL267062
Type:
Small organic molecule
Emp. Form.:
C25H29N3O
Mol. Mass.:
387.5173
SMILES:
O=C1N(CCN2CCC(CC2)c2c[nH]c3ccccc23)CCCc2ccccc12
: