Target
Genome polyprotein
Ligand
BDBM50125375
Substrate
Meas. Tech.
ChEBML_143488
IC50
11000±n/a nM
Citation
 Han, WHu, ZJiang, XWasserman, ZRDecicco, CP Glycine alpha-ketoamides as HCV NS3 protease inhibitors. Bioorg Med Chem Lett 13:1111-4 (2003)  
Target
Name:
Genome polyprotein
Synonyms:
Genome polyprotein Hepatitis C virus polyprotein RNA-dependent RNA polymerase (NS5B)
Type:
Protein
Mol. Mass.:
327266.82
Organism:
Hepatitis C virus (HCV)
Description:
P26664
Residue:
3011
  
Inhibitor
Name:
BDBM50125375
Synonyms:
CHEMBL13447 | Pyrazine-2-carboxylic acid ((S)-1-{(1S,2S)-1-[(S)-1-((S)-1-benzylaminooxalyl-propylcarbamoyl)-2-cyclohexyl-ethylcarbamoyl]-2-methyl-butylcarbamoyl}-3-methyl-butyl)-amide
Type:
Small organic molecule
Emp. Form.:
C38H55N7O6
Mol. Mass.:
705.8866
SMILES:
CC[C@H](C)[C@H](NC(=O)[C@H](CC(C)C)NC(=O)c1cnccn1)C(=O)N[C@@H](CC1CCCCC1)C(=O)N[C@@H](CC)C(=O)C(=O)NCc1ccccc1
: