Target
Leukotriene A-4 hydrolase
Ligand
BDBM50125433
Substrate
Meas. Tech.
ChEBML_96942
IC50
0.800000±n/a nM
Citation
 Penning, TDChandrakumar, NSDesai, BNDjuric, SWGasiecki, AFMalecha, JWMiyashiro, JMRussell, MAAskonas, LJGierse, JKHarding, EIHighkin, MKKachur, JFKim, SHVillani-Price, DPyla, EYGhoreishi-Haack, NSSmith, WG Synthesis of imidazopyridines and purines as potent inhibitors of leukotriene A4 hydrolase. Bioorg Med Chem Lett 13:1137-9 (2003)  
Target
Name:
Leukotriene A-4 hydrolase
Synonyms:
LKHA4_HUMAN LTA4 Leukotriene A(4) hydrolase Leukotriene A4 hydrolase
Type:
Hydrolase; metalloprotease
Mol. Mass.:
69280.41
Organism:
Homo sapiens (Human)
Description:
Human recombinant LTA4H.
Residue:
611
  
Inhibitor
Name:
BDBM50125433
Synonyms:
1-[2-(4-Benzyl-phenoxy)-ethyl]-1H-imidazo[4,5-b]pyridine-5-carbonitrile | CHEMBL273570
Type:
Small organic molecule
Emp. Form.:
C22H18N4O
Mol. Mass.:
354.4045
SMILES:
N#Cc1ccc2n(CCOc3ccc(Cc4ccccc4)cc3)cnc2n1
: