Target
Peroxisome proliferator-activated receptor gamma
Ligand
BDBM50126018
Substrate
Meas. Tech.
ChEMBL_154187 (CHEMBL762736)
EC50
23±n/a nM
Citation
 Santini, CBerger, GDHan, WMosley, RMacNaul, KBerger, JDoebber, TWu, MMoller, DETolman, RLSahoo, SP Phenylacetic acid derivatives as hPPAR agonists. Bioorg Med Chem Lett 13:1277-80 (2003)  
Target
Name:
Peroxisome proliferator-activated receptor gamma
Synonyms:
NR1C3 PPAR-gamma PPARG_HUMAN Peroxisome proliferator-activated receptor gamma (PPAR gamma) Peroxisome proliferator-activated receptor gamma (PPARĪ³) peroxisome proliferator-activated receptor gamma isoform 2
Type:
Nuclear Receptor
Mol. Mass.:
57613.46
Organism:
Homo sapiens (Human)
Description:
P37231
Residue:
505
  
Inhibitor
Name:
BDBM50126018
Synonyms:
2-(3-chloro-4-(3-(7-propyl-3-(trifluoromethyl)benzo[d]isoxazol-6-yloxy)propylthio)phenyl)acetic acid {3-Chloro-4-[3-(7-propyl-3-trifluoromethyl-benzo[d]isoxazol-6-yloxy)-propylsulfanyl]-phenyl}-acetic acid | {3-chloro-4-[(3-{[7-propyl-3-(trifluoromethyl)-1,2-benzisoxazol-6-yl]oxy}propyl)sulfanyl]phenyl}acetic acid
Type:
Small organic molecule
Emp. Form.:
C22H21ClF3NO4S
Mol. Mass.:
487.92
SMILES:
CCCc1c(OCCCSc2ccc(CC(O)=O)cc2Cl)ccc2c(noc12)C(F)(F)F
: