Target
Beta-3 adrenergic receptor
Ligand
BDBM50126071
Substrate
Meas. Tech.
ChEBML_39070
EC50
0.360000±n/a nM
Citation
 Harada, HHirokawa, YSuzuki, KHiyama, YOue, MKawashima, HYoshida, NFurutani, YKato, S Novel and potent human and rat beta3-adrenergic receptor agonists containing substituted 3-indolylalkylamines. Bioorg Med Chem Lett 13:1301-5 (2003)  
Target
Name:
Beta-3 adrenergic receptor
Synonyms:
ADRB3 ADRB3_HUMAN Beta-2 adrenergic receptor and beta-3 adrenergic receptor Beta-3 adrenoreceptor | adrenergic Beta3
Type:
G Protein-Coupled Receptor (GPCR)
Mol. Mass.:
43534.88
Organism:
Homo sapiens (Human)
Description:
Residue:
408
  
Inhibitor
Name:
BDBM50126071
Synonyms:
(R)-1-((R)-3-Chloro-phenyl)-2-[2-(7-methoxy-1H-indol-3-yl)-1-methyl-ethylamino]-ethanol | CHEMBL26183
Type:
Small organic molecule
Emp. Form.:
C20H23ClN2O2
Mol. Mass.:
358.862
SMILES:
COc1cccc2c(C[C@@H](C)NC[C@H](O)c3cccc(Cl)c3)c[nH]c12
: