Target
Melanocyte-stimulating hormone receptor
Ligand
BDBM50126095
Substrate
Meas. Tech.
ChEBML_106815
EC50
0.300000±n/a nM
Citation
 Cheung, AWDanho, WSwistok, JQi, LKurylko, GRowan, KYeon, MFranco, LChu, XJChen, LYagaloff, K Structure-activity relationship of cyclic peptide penta-c[Asp-His(6)-DPhe(7)-Arg(8)-Trp(9)-Lys]-NH(2) at the human melanocortin-1 and -4 receptors: His(6) substitution. Bioorg Med Chem Lett 13:1307-11 (2003)  
Target
Name:
Melanocyte-stimulating hormone receptor
Synonyms:
MC1-R MSH-R MSHR_HUMAN Melanocortin receptor (M1 and M4) Melanocortin receptor 1 (MC1-R) | Melanocortin receptor 1 (MC1R)
Type:
Enzyme
Mol. Mass.:
34717.23
Organism:
Homo sapiens (Human)
Description:
Q01726
Residue:
317
  
Inhibitor
Name:
BDBM50126095
Synonyms:
(12S,16S,23R)-15-(2-Acetylamino-hexanoylamino)-9-benzyl-12-((R)-2-carbamoyl-ethyl)-6-(3-guanidino-propyl)-3-(1H-indol-3-ylmethyl)-5,8,11,14,17-pentaoxo-2-(S)-oxo-1,4,7,10,13,18hexaaza-cyclotricosane-23-carboxylacid amide | CHEMBL3037885
Type:
Small organic molecule
Emp. Form.:
C49H70N14O10
Mol. Mass.:
1015.1679
SMILES:
CCCC[C@H](NC(C)=O)C(=O)N[C@H]1CC(=O)NCCCC[C@H](NC(=O)[C@H](Cc2c[nH]c3ccccc23)NC(=O)[C@H](CCCN=C(N)N)NC(=O)[C@@H](Cc2ccccc2)NC(=O)[C@H](CCC(N)=O)NC1=O)C(N)=O
: