Target
Sodium-dependent serotonin transporter
Ligand
BDBM22165
Substrate
Meas. Tech.
ChEBML_201833
Ki
126±n/a nM
Citation
 Lewis, DZhang, YPrisinzano, TDersch, CMRothman, RBJacobson, AERice, KC Further exploration of 1-[2-[Bis-(4-fluorophenyl)methoxy]ethyl]piperazine (GBR 12909): role of N-aromatic, N-heteroaromatic, and 3-oxygenated N-phenylpropyl substituents on affinity for the dopamine and serotonin transporter. Bioorg Med Chem Lett 13:1385-9 (2003)  
Target
Name:
Sodium-dependent serotonin transporter
Synonyms:
5-HT Transporter 5HT transporter Anandamid membrane transporter, AMT Monoamine transporters; Norepinephrine & serotonin Slc6a4 Sodium-dependent serotonin transporter (SERT) | imipramine receptor
Type:
Multi-pass membrane protein
Mol. Mass.:
70168.43
Organism:
Rattus norvegicus (rat)
Description:
P31652
Residue:
630
  
Inhibitor
Name:
BDBM22165
Synonyms:
1-{2-[bis(4-fluorophenyl)methoxy]ethyl}-4-(3-phenylpropyl)piperazine CHEMBL281594 CHEMBL543876 GBR-12909 US9944618, Compound ID No. 175 | Vanoxerine
Type:
Small organic molecule
Emp. Form.:
C28H32F2N2O
Mol. Mass.:
450.5633
SMILES:
Fc1ccc(cc1)C(OCCN1CCN(CCCc2ccccc2)CC1)c1ccc(F)cc1
: