Target
Dual 3',5'-cyclic-AMP and -GMP phosphodiesterase 11A
Ligand
BDBM14777
Substrate
Meas. Tech.
ChEBML_156293
IC50
37±n/a nM
Citation
 Maw, GNAllerton, CMGbekor, EMillion, WA Design, synthesis and biological activity of beta-carboline-based type-5 phosphodiesterase inhibitors. Bioorg Med Chem Lett 13:1425-8 (2003)  
Target
Name:
Dual 3',5'-cyclic-AMP and -GMP phosphodiesterase 11A
Synonyms:
Dual 3',5'-cyclic-AMP and -GMP phosphodiesterase 11A PDE11_HUMAN Phosphodiesterase 11A Phosphodiesterase 11A4 | cAMP and cGMP phosphodiesterase 11A
Type:
Enzyme
Mol. Mass.:
104751.53
Organism:
Homo sapiens (Human)
Description:
Q9HCR9
Residue:
933
  
Inhibitor
Name:
BDBM14777
Synonyms:
(2R,8R)-2-(2H-1,3-benzodioxol-5-yl)-6-methyl-3,6,17-triazatetracyclo[8.7.0.0^{3,8}.0^{11,16}]heptadeca-1(10),11(16),12,14-tetraene-4,7-dione CHEMBL779 GF 196960 | Tadalafil
Type:
Small organic molecule
Emp. Form.:
C22H19N3O4
Mol. Mass.:
389.404
SMILES:
[H][C@]12Cc3c([nH]c4ccccc34)[C@H](N1C(=O)CN(C)C2=O)c1ccc2OCOc2c1
: