Target
Peroxisome proliferator-activated receptor delta
Ligand
BDBM28661
Substrate
Meas. Tech.
ChEBML_154038
EC50
20±n/a nM
Citation
 Sznaidman, MLHaffner, CDMaloney, PRFivush, AChao, EGoreham, DSierra, MLLeGrumelec, CXu, HEMontana, VGLambert, MHWillson, TMOliver, WRSternbach, DD Novel selective small molecule agonists for peroxisome proliferator-activated receptor delta (PPARdelta)--synthesis and biological activity. Bioorg Med Chem Lett 13:1517-21 (2003)  
Target
Name:
Peroxisome proliferator-activated receptor delta
Synonyms:
NUC1 Nuclear hormone receptor 1 PPAR-beta PPARD_MOUSE Ppard
Type:
PROTEIN
Mol. Mass.:
49719.14
Organism:
Mus musculus
Description:
ChEMBL_1288931
Residue:
440
  
Inhibitor
Name:
BDBM28661
Synonyms:
2-{2-methyl-4-[({4-methyl-2-[4-(trifluoromethyl)phenyl]-1,3-thiazol-5-yl}methyl)sulfanyl]phenoxy}acetic acid GW 501516 GW1516 | GW501516
Type:
Small organic molecule
Emp. Form.:
C21H18F3NO3S2
Mol. Mass.:
453.498
SMILES:
Cc1nc(sc1CSc1ccc(OCC(O)=O)c(C)c1)-c1ccc(cc1)C(F)(F)F
: