Target
Beta-secretase 1
Ligand
BDBM50127403
Substrate
Meas. Tech.
ChEMBL_41374 (CHEMBL653497)
IC50
47000±n/a nM
Citation
 Hom, RKFang, LYMamo, STung, JSGuinn, ACWalker, DEDavis, DLGailunas, AFThorsett, EDSinha, SKnops, JEJewett, NEAnderson, JPJohn, V Design and synthesis of statine-based cell-permeable peptidomimetic inhibitors of human beta-secretase. J Med Chem 46:1799-802 (2003)  
Target
Name:
Beta-secretase 1
Synonyms:
ASP2 Aspartyl protease 2 BACE1 Beta-secretase (BACE) Beta-secretase 1 (BACE 1) Beta-secretase 1 (BACE1) Beta-site amyloid precursor protein cleaving enzyme 1 Memapsin-2 beta-Secretase (BACE-1) | beta-Secretase (BACE1)
Type:
Protein
Mol. Mass.:
55755.10
Organism:
Homo sapiens (Human)
Description:
P56817
Residue:
501
  
Inhibitor
Name:
BDBM50127403
Synonyms:
4-(2-{4-[2-(2-tert-Butoxycarbonylamino-3-methyl-butyrylamino)-4-methylsulfanyl-butyrylamino]-3-hydroxy-6-methyl-heptanoylamino}-3-methyl-butyrylamino)-butyric acid | CHEMBL53648
Type:
Small organic molecule
Emp. Form.:
C32H59N5O9S
Mol. Mass.:
689.904
SMILES:
CSCC[C@H](NC(=O)[C@@H](NC(=O)OC(C)(C)C)C(C)C)C(=O)NC(CC(C)C)[C@@H](O)CC(=O)N[C@H](C(C)C)C(=O)NCCCC(O)=O
: