Target
Matrix metalloproteinase-9
Ligand
BDBM50127467
Substrate
Meas. Tech.
ChEMBL_105385 (CHEMBL710804)
Ki
>2128±n/a nM
Citation
 Cherney, RJDuan, JJVoss, MEChen, LWang, LMeyer, DTWasserman, ZRHardman, KDLiu, RQCovington, MBQian, MMandlekar, SChrist, DDTrzaskos, JMNewton, RCMagolda, RLWexler, RRDecicco, CP Design, synthesis, and evaluation of benzothiadiazepine hydroxamates as selective tumor necrosis factor-alpha converting enzyme inhibitors. J Med Chem 46:1811-23 (2003)  
Target
Name:
Matrix metalloproteinase-9
Synonyms:
67 kDa matrix metalloproteinase-9 92 kDa gelatinase CLG4B Gelatinase B MMP9 Matrix metalloproteinase 9 (MMP-9) Matrix metalloproteinase-9 (MMP9)
Type:
Enzyme
Mol. Mass.:
78452.28
Organism:
Homo sapiens (Human)
Description:
P14780
Residue:
707
  
Inhibitor
Name:
BDBM50127467
Synonyms:
2-[7-(3,5-Diethoxy-benzyloxy)-1,1-dioxo-1,3,4,5-tetrahydro-1lambda*6*-benzo[f][1,2,5]thiadiazepin-2-yl]-N-hydroxy-propionamide | CHEMBL415949
Type:
Small organic molecule
Emp. Form.:
C22H29N3O7S
Mol. Mass.:
479.547
SMILES:
CCOc1cc(COc2ccc3c(NCCN([C@H](C)C(=O)NO)S3(=O)=O)c2)cc(OCC)c1
: