Target
Disintegrin and metalloproteinase domain-containing protein 17
Ligand
BDBM50127471
Substrate
Meas. Tech.
ChEMBL_212590 (CHEMBL813237)
Ki
17±n/a nM
Citation
 Cherney, RJDuan, JJVoss, MEChen, LWang, LMeyer, DTWasserman, ZRHardman, KDLiu, RQCovington, MBQian, MMandlekar, SChrist, DDTrzaskos, JMNewton, RCMagolda, RLWexler, RRDecicco, CP Design, synthesis, and evaluation of benzothiadiazepine hydroxamates as selective tumor necrosis factor-alpha converting enzyme inhibitors. J Med Chem 46:1811-23 (2003)  
Target
Name:
Disintegrin and metalloproteinase domain-containing protein 17
Synonyms:
ADA17_HUMAN CSVP Disintegrin and metalloproteinase domain-containing protein 17 (ADAM17) TNF-alpha convertase TNF-alpha-converting enzyme (TACE) Tumor necrosis factor-α converting enzyme (TACE)
Type:
Enzyme
Mol. Mass.:
93007.89
Organism:
Homo sapiens (Human)
Description:
Residue:
824
  
Inhibitor
Name:
BDBM50127471
Synonyms:
2-[7-(3,5-Dimethoxy-benzyloxy)-1,1-dioxo-1,3,4,5-tetrahydro-1lambda*6*-benzo[f][1,2,5]thiadiazepin-2-yl]-4-methyl-pentanoic acid hydroxyamide | CHEMBL293074
Type:
Small organic molecule
Emp. Form.:
C23H31N3O7S
Mol. Mass.:
493.573
SMILES:
COc1cc(COc2ccc3c(NCCN([C@H](CC(C)C)C(=O)NO)S3(=O)=O)c2)cc(OC)c1
: